Necesito orientación de alguien que entienda bien de Linux

khran

Explorador
Desde
16 Feb 2021
Mensajes
41
Reacciones
18
Honor
22
Buenas estoy ejecutando un repack propio en Linux pero lo ejecuto a través de wine alguien sabría decirme por qué me lanza este error el worldserver tengo 2 emuladores mas funcionando y no me dieron este problema
 

Archivos adjuntos

  • esto pasa al abrrir el server.txt
    6.5 KB · Visitas: 39
  • 0582F840-A2D4-4757-A407-A373D4133433.jpeg
    0582F840-A2D4-4757-A407-A373D4133433.jpeg
    578.5 KB · Visitas: 56

khran

Explorador
Desde
16 Feb 2021
Mensajes
41
Reacciones
18
Honor
22
Tengo este problema en la compilación sea cual sea el source este es el ejemplo de lo que me pasa
en windows no tengo problema de compilacion ninguno pero en linux se me complica simpre tengo este error

-- Configuring done
-- Generating done
-- Build files have been written to: /root/Repos/FirestormWoD/build
root@vmi666237:~/Repos/FirestormWoD/build# make -j 10 && make install
Scanning dependencies of target Detour
Scanning dependencies of target jemalloc
Scanning dependencies of target g3dlib
Scanning dependencies of target revision_data.h
Scanning dependencies of target Recast
Scanning dependencies of target gsoap
Scanning dependencies of target gamePCH.cpp_dephelp
Scanning dependencies of target sharedPCH.cpp_dephelp
Scanning dependencies of target collisionPCH.cpp_dephelp
Scanning dependencies of target authPCH.cpp_dephelp
--
Could not find a proper repository signature (hash) - you may need to pull tags with git fetch -t
Continuing anyway - note that the versionstring will be set to "unknown 1970-01-01 00:00:00 (Archived)"
[ 0%] Building CXX object dep/recastnavigation/Detour/CMakeFiles/Detour.dir/Source/DetourAlloc.cpp.o
[ 0%] Building CXX object dep/recastnavigation/Recast/CMakeFiles/Recast.dir/Source/Recast.cpp.o
[ 0%] Building CXX object src/server/authserver/CMakeFiles/authPCH.cpp_dephelp.dir/PrecompiledHeaders/authPCH.cpp.o
[ 0%] Building CXX object src/server/shared/CMakeFiles/sharedPCH.cpp_dephelp.dir/PrecompiledHeaders/sharedPCH.cpp.o
[ 0%] Built target revision_data.h
[ 0%] Building CXX object dep/gsoap/CMakeFiles/gsoap.dir/soapC.cpp.o
[ 0%] Building CXX object dep/recastnavigation/Recast/CMakeFiles/Recast.dir/Source/RecastAlloc.cpp.o
[ 0%] Building CXX object src/server/collision/CMakeFiles/collisionPCH.cpp_dephelp.dir/PrecompiledHeaders/collisionPCH.cpp.o
[ 0%] Building C object dep/jemalloc/CMakeFiles/jemalloc.dir/src/arena.c.o
[ 0%] Building CXX object dep/recastnavigation/Detour/CMakeFiles/Detour.dir/Source/DetourCommon.cpp.o
[ 1%] Building CXX object dep/g3dlite/CMakeFiles/g3dlib.dir/source/AABox.cpp.o
[ 1%] Building CXX object dep/g3dlite/CMakeFiles/g3dlib.dir/source/Any.cpp.o
[ 1%] Building CXX object src/server/game/CMakeFiles/gamePCH.cpp_dephelp.dir/PrecompiledHeaders/gamePCH.cpp.o
[ 1%] Building CXX object dep/recastnavigation/Recast/CMakeFiles/Recast.dir/Source/RecastArea.cpp.o
[ 1%] Building CXX object dep/recastnavigation/Detour/CMakeFiles/Detour.dir/Source/DetourNavMesh.cpp.o
In file included from /root/Repos/FirestormWoD/src/server/collision/PrecompiledHeaders/collisionPCH.cpp:1:
In file included from /root/Repos/FirestormWoD/src/server/collision/PrecompiledHeaders/collisionPCH.h:3:
In file included from /root/Repos/FirestormWoD/src/server/collision/Maps/MapTree.h:13:
In file included from /root/Repos/FirestormWoD/src/server/collision/BoundingIntervalHierarchy.h:12:
/root/Repos/FirestormWoD/dep/g3dlite/include/G3D/Vector3.h:131:25: warning: definition of implicit copy constructor for 'Vector3' is deprecated because it has a user-declared copy assignment operator [-Wdeprecated-copy]
Vector3& __fastcall operator= (const Vector3& rkVector);
^
/root/Repos/FirestormWoD/dep/g3dlite/include/G3D/Vector3.h:160:16: note: in implicit copy constructor for 'G3D::Vector3' first required here
return *this * (1.0f / s);
^
[ 1%] Building CXX object dep/recastnavigation/Recast/CMakeFiles/Recast.dir/Source/RecastContour.cpp.o
[ 1%] Building CXX object dep/gsoap/CMakeFiles/gsoap.dir/soapServer.cpp.o
[ 1%] Building CXX object dep/recastnavigation/Detour/CMakeFiles/Detour.dir/Source/DetourNavMeshBuilder.cpp.o
[ 1%] Building CXX object dep/recastnavigation/Recast/CMakeFiles/Recast.dir/Source/RecastFilter.cpp.o
In file included from /root/Repos/FirestormWoD/src/server/authserver/PrecompiledHeaders/authPCH.cpp:1:
In file included from /root/Repos/FirestormWoD/src/server/authserver/PrecompiledHeaders/authPCH.h:2:
In file included from /root/Repos/FirestormWoD/src/server/shared/Database/DatabaseEnv.h:17:
/root/Repos/FirestormWoD/src/server/shared/Database/QueryResult.h:88:9: fatal error: unknown type name 'my_bool'
my_bool* m_isNull;
^
In file included from /root/Repos/FirestormWoD/src/server/shared/PrecompiledHeaders/sharedPCH.cpp:1:
In file included from /root/Repos/FirestormWoD/src/server/shared/PrecompiledHeaders/sharedPCH.h:14:
In file included from /root/Repos/FirestormWoD/src/server/shared/Database/SQLOperation.h:15:
/root/Repos/FirestormWoD/src/server/shared/Database/QueryResult.h:88:9: fatal error: unknown type name 'my_bool'
my_bool* m_isNull;
^
1 error generated.
make[2]: *** [src/server/shared/CMakeFiles/sharedPCH.cpp_dephelp.dir/build.make:63: src/server/shared/CMakeFiles/sharedPCH.cpp_dephelp.dir/PrecompiledHeaders/sharedPCH.cpp.o] Error 1
make[1]: *** [CMakeFiles/Makefile2:632: src/server/shared/CMakeFiles/sharedPCH.cpp_dephelp.dir/all] Error 2
make[1]: *** Waiting for unfinished jobs....
[ 1%] Building CXX object dep/recastnavigation/Recast/CMakeFiles/Recast.dir/Source/RecastLayers.cpp.o
1 warning generated.
1 error generated.
make[2]: *** [src/server/authserver/CMakeFiles/authPCH.cpp_dephelp.dir/build.make:63: src/server/authserver/CMakeFiles/authPCH.cpp_dephelp.dir/PrecompiledHeaders/authPCH.cpp.o] Error 1
make[1]: *** [CMakeFiles/Makefile2:879: src/server/authserver/CMakeFiles/authPCH.cpp_dephelp.dir/all] Error 2
[ 1%] Linking CXX shared module libcollisionPCH.cpp_dephelp.so
[ 1%] Building CXX object dep/recastnavigation/Detour/CMakeFiles/Detour.dir/Source/DetourNavMeshQuery.cpp.o
[ 1%] Building CXX object dep/gsoap/CMakeFiles/gsoap.dir/stdsoap2.cpp.o
[ 1%] Building C object dep/jemalloc/CMakeFiles/jemalloc.dir/src/atomic.c.o
[ 2%] Building CXX object dep/recastnavigation/Recast/CMakeFiles/Recast.dir/Source/RecastMesh.cpp.o
[ 2%] Built target collisionPCH.cpp_dephelp
[ 2%] Building CXX object dep/recastnavigation/Recast/CMakeFiles/Recast.dir/Source/RecastMeshDetail.cpp.o
[ 2%] Building C object dep/jemalloc/CMakeFiles/jemalloc.dir/src/base.c.o
[ 3%] Building C object dep/jemalloc/CMakeFiles/jemalloc.dir/src/bitmap.c.o
In file included from /root/Repos/FirestormWoD/src/server/game/PrecompiledHeaders/gamePCH.cpp:1:
In file included from /root/Repos/FirestormWoD/src/server/game/PrecompiledHeaders/gamePCH.h:3:
In file included from /root/Repos/FirestormWoD/src/server/game/Server/WorldSocket.h:34:
In file included from /root/Repos/FirestormWoD/src/server/shared/Cryptography/Authentication/AuthCrypt.h:12:
/root/Repos/FirestormWoD/src/server/shared/Cryptography/ARC4.h:24:24: fatal error: field has incomplete type 'EVP_CIPHER_CTX' (aka 'evp_cipher_ctx_st')
EVP_CIPHER_CTX m_ctx;
^
/usr/include/openssl/ossl_typ.h:90:16: note: forward declaration of 'evp_cipher_ctx_st'
typedef struct evp_cipher_ctx_st EVP_CIPHER_CTX;
^
[ 3%] Building CXX object dep/recastnavigation/Detour/CMakeFiles/Detour.dir/Source/DetourNode.cpp.o
[ 3%] Building C object dep/jemalloc/CMakeFiles/jemalloc.dir/src/chunk.c.o
[ 3%] Building C object dep/jemalloc/CMakeFiles/jemalloc.dir/src/chunk_dss.c.o
[ 3%] Building C object dep/jemalloc/CMakeFiles/jemalloc.dir/src/chunk_mmap.c.o
[ 3%] Building C object dep/jemalloc/CMakeFiles/jemalloc.dir/src/ckh.c.o
[ 3%] Building CXX object dep/recastnavigation/Recast/CMakeFiles/Recast.dir/Source/RecastRasterization.cpp.o
[ 3%] Building C object dep/jemalloc/CMakeFiles/jemalloc.dir/src/ctl.c.o
[ 3%] Building C object dep/jemalloc/CMakeFiles/jemalloc.dir/src/extent.c.o
[ 3%] Building CXX object dep/recastnavigation/Recast/CMakeFiles/Recast.dir/Source/RecastRegion.cpp.o
[ 3%] Building C object dep/jemalloc/CMakeFiles/jemalloc.dir/src/hash.c.o
[ 3%] Linking CXX static library libDetour.a
1 error generated.
make[2]: *** [src/server/game/CMakeFiles/gamePCH.cpp_dephelp.dir/build.make:63: src/server/game/CMakeFiles/gamePCH.cpp_dephelp.dir/PrecompiledHeaders/gamePCH.cpp.o] Error 1
make[1]: *** [CMakeFiles/Makefile2:714: src/server/game/CMakeFiles/gamePCH.cpp_dephelp.dir/all] Error 2
[ 3%] Building C object dep/jemalloc/CMakeFiles/jemalloc.dir/src/huge.c.o
[ 3%] Building C object dep/jemalloc/CMakeFiles/jemalloc.dir/src/jemalloc.c.o
[ 3%] Built target Detour
[ 3%] Building C object dep/jemalloc/CMakeFiles/jemalloc.dir/src/mb.c.o
[ 3%] Building CXX object dep/g3dlite/CMakeFiles/g3dlib.dir/source/AnyTableReader.cpp.o
[ 3%] Building C object dep/jemalloc/CMakeFiles/jemalloc.dir/src/mutex.c.o
[ 3%] Building C object dep/jemalloc/CMakeFiles/jemalloc.dir/src/prof.c.o
[ 3%] Building C object dep/jemalloc/CMakeFiles/jemalloc.dir/src/quarantine.c.o
[ 4%] Building C object dep/jemalloc/CMakeFiles/jemalloc.dir/src/rtree.c.o
[ 4%] Building C object dep/jemalloc/CMakeFiles/jemalloc.dir/src/stats.c.o
[ 4%] Building C object dep/jemalloc/CMakeFiles/jemalloc.dir/src/tcache.c.o
[ 4%] Building C object dep/jemalloc/CMakeFiles/jemalloc.dir/src/tsd.c.o
[ 4%] Building C object dep/jemalloc/CMakeFiles/jemalloc.dir/src/util.c.o
[ 4%] Building CXX object dep/g3dlite/CMakeFiles/g3dlib.dir/source/BinaryFormat.cpp.o
[ 4%] Building CXX object dep/g3dlite/CMakeFiles/g3dlib.dir/source/BinaryInput.cpp.o
[ 4%] Building CXX object dep/g3dlite/CMakeFiles/g3dlib.dir/source/BinaryOutput.cpp.o
[ 4%] Building CXX object dep/g3dlite/CMakeFiles/g3dlib.dir/source/Box.cpp.o
[ 4%] Building CXX object dep/g3dlite/CMakeFiles/g3dlib.dir/source/Capsule.cpp.o
[ 4%] Building CXX object dep/g3dlite/CMakeFiles/g3dlib.dir/source/CollisionDetection.cpp.o
[ 4%] Building CXX object dep/g3dlite/CMakeFiles/g3dlib.dir/source/CoordinateFrame.cpp.o
[ 4%] Building CXX object dep/g3dlite/CMakeFiles/g3dlib.dir/source/Crypto.cpp.o
[ 4%] Linking CXX static library libRecast.a
[ 4%] Built target Recast
[ 4%] Building CXX object dep/g3dlite/CMakeFiles/g3dlib.dir/source/Cylinder.cpp.o
[ 4%] Linking C static library libjemalloc.a
[ 4%] Building CXX object dep/g3dlite/CMakeFiles/g3dlib.dir/source/debugAssert.cpp.o
[ 4%] Built target jemalloc
[ 4%] Building CXX object dep/g3dlite/CMakeFiles/g3dlib.dir/source/FileSystem.cpp.o
[ 5%] Building CXX object dep/g3dlite/CMakeFiles/g3dlib.dir/source/fileutils.cpp.o
[ 5%] Building CXX object dep/g3dlite/CMakeFiles/g3dlib.dir/source/format.cpp.o
[ 5%] Building CXX object dep/g3dlite/CMakeFiles/g3dlib.dir/source/g3dfnmatch.cpp.o
[ 5%] Building CXX object dep/g3dlite/CMakeFiles/g3dlib.dir/source/g3dmath.cpp.o
[ 5%] Building CXX object dep/g3dlite/CMakeFiles/g3dlib.dir/source/GThread.cpp.o
[ 5%] Building CXX object dep/g3dlite/CMakeFiles/g3dlib.dir/source/Line.cpp.o
[ 5%] Building CXX object dep/g3dlite/CMakeFiles/g3dlib.dir/source/LineSegment.cpp.o
[ 5%] Building CXX object dep/g3dlite/CMakeFiles/g3dlib.dir/source/Log.cpp.o
[ 5%] Building CXX object dep/g3dlite/CMakeFiles/g3dlib.dir/source/Matrix3.cpp.o
[ 5%] Building CXX object dep/g3dlite/CMakeFiles/g3dlib.dir/source/Matrix4.cpp.o
[ 5%] Building CXX object dep/g3dlite/CMakeFiles/g3dlib.dir/source/MemoryManager.cpp.o
[ 5%] Building CXX object dep/g3dlite/CMakeFiles/g3dlib.dir/source/PhysicsFrame.cpp.o
[ 5%] Building CXX object dep/g3dlite/CMakeFiles/g3dlib.dir/source/Plane.cpp.o
[ 5%] Building CXX object dep/g3dlite/CMakeFiles/g3dlib.dir/source/prompt.cpp.o
[ 6%] Building CXX object dep/g3dlite/CMakeFiles/g3dlib.dir/source/Quat.cpp.o
[ 6%] Linking CXX static library libgsoap.a
[ 6%] Building CXX object dep/g3dlite/CMakeFiles/g3dlib.dir/source/Random.cpp.o
[ 6%] Built target gsoap
[ 6%] Building CXX object dep/g3dlite/CMakeFiles/g3dlib.dir/source/Ray.cpp.o
[ 6%] Building CXX object dep/g3dlite/CMakeFiles/g3dlib.dir/source/RegistryUtil.cpp.o
[ 6%] Building CXX object dep/g3dlite/CMakeFiles/g3dlib.dir/source/Sphere.cpp.o
[ 6%] Building CXX object dep/g3dlite/CMakeFiles/g3dlib.dir/source/stringutils.cpp.o
[ 6%] Building CXX object dep/g3dlite/CMakeFiles/g3dlib.dir/source/System.cpp.o
[ 6%] Building CXX object dep/g3dlite/CMakeFiles/g3dlib.dir/source/TextInput.cpp.o
[ 6%] Building CXX object dep/g3dlite/CMakeFiles/g3dlib.dir/source/TextOutput.cpp.o
[ 6%] Building CXX object dep/g3dlite/CMakeFiles/g3dlib.dir/source/Triangle.cpp.o
[ 6%] Building CXX object dep/g3dlite/CMakeFiles/g3dlib.dir/source/uint128.cpp.o
[ 6%] Building CXX object dep/g3dlite/CMakeFiles/g3dlib.dir/source/UprightFrame.cpp.o
[ 6%] Building CXX object dep/g3dlite/CMakeFiles/g3dlib.dir/source/Vector2.cpp.o
[ 7%] Building CXX object dep/g3dlite/CMakeFiles/g3dlib.dir/source/Vector3.cpp.o
[ 7%] Building CXX object dep/g3dlite/CMakeFiles/g3dlib.dir/source/Vector4.cpp.o
[ 7%] Linking CXX static library libg3dlib.a
[ 7%] Built target g3dlib
make: *** [Makefile:130: all] Error 2


eso en el de wod que te mande
y en el legion sale esto
-- Configuring done
-- Generating done
-- Build files have been written to: /root/Repos/Legion/build
root@vmi666237:~/Repos/Legion/build# make -j 10
Scanning dependencies of target fmt
Scanning dependencies of target cds
Scanning dependencies of target Detour
Scanning dependencies of target g3dlib
Scanning dependencies of target Recast
Scanning dependencies of target gsoap
Scanning dependencies of target protobuf
Scanning dependencies of target protoPCH.cpp_dephelp
Scanning dependencies of target commonPCH.cpp_dephelp
Scanning dependencies of target revision_data.h
[ 0%] Building CXX object dep/fmt/CMakeFiles/fmt.dir/fmt/format.cc.o
[ 0%] Building CXX object dep/recastnavigation/Recast/CMakeFiles/Recast.dir/Source/Recast.cpp.o
[ 0%] Building CXX object dep/gsoap/CMakeFiles/gsoap.dir/httpget.cpp.o
[ 0%] Building CXX object dep/recastnavigation/Detour/CMakeFiles/Detour.dir/Source/DetourAlloc.cpp.o
-- WARNING - Missing repository tags - you may need to pull tags with git fetch -t
-- WARNING - Continuing anyway - note that the versionstring will be set to 0000-00-00 00:00:00 (Archived)
[ 0%] Built target revision_data.h
[ 0%] Building CXX object src/common/CMakeFiles/commonPCH.cpp_dephelp.dir/PrecompiledHeaders/commonPCH.cpp.o
[ 0%] Building CXX object src/server/proto/CMakeFiles/protoPCH.cpp_dephelp.dir/PrecompiledHeaders/protoPCH.cpp.o
[ 0%] Building CXX object dep/g3dlite/CMakeFiles/g3dlib.dir/source/AABox.cpp.o
[ 0%] Building CXX object dep/gsoap/CMakeFiles/gsoap.dir/httppost.cpp.o
[ 1%] Building CXX object dep/cds/CMakeFiles/cds.dir/src/dhp.cpp.o
[ 1%] Building CXX object dep/protobuf/CMakeFiles/protobuf.dir/src/google/protobuf/compiler/importer.cc.o
[ 1%] Building CXX object dep/recastnavigation/Detour/CMakeFiles/Detour.dir/Source/DetourCommon.cpp.o
[ 1%] Building CXX object dep/recastnavigation/Recast/CMakeFiles/Recast.dir/Source/RecastAlloc.cpp.o
[ 1%] Building CXX object dep/recastnavigation/Detour/CMakeFiles/Detour.dir/Source/DetourNavMesh.cpp.o
[ 1%] Building CXX object dep/recastnavigation/Recast/CMakeFiles/Recast.dir/Source/RecastArea.cpp.o
[ 1%] Building CXX object dep/gsoap/CMakeFiles/gsoap.dir/soapC.cpp.o
[ 1%] Building CXX object dep/gsoap/CMakeFiles/gsoap.dir/soapServer.cpp.o
[ 1%] Building CXX object dep/g3dlite/CMakeFiles/g3dlib.dir/source/Any.cpp.o
[ 1%] Building CXX object dep/cds/CMakeFiles/cds.dir/src/dllmain.cpp.o
[ 1%] Building CXX object dep/recastnavigation/Recast/CMakeFiles/Recast.dir/Source/RecastContour.cpp.o
[ 1%] Building CXX object dep/protobuf/CMakeFiles/protobuf.dir/src/google/protobuf/compiler/parser.cc.o
[ 1%] Building CXX object dep/recastnavigation/Detour/CMakeFiles/Detour.dir/Source/DetourNavMeshBuilder.cpp.o
[ 1%] Building CXX object dep/fmt/CMakeFiles/fmt.dir/fmt/ostream.cc.o
[ 1%] Building CXX object dep/cds/CMakeFiles/cds.dir/src/hp.cpp.o
[ 1%] Building CXX object dep/g3dlite/CMakeFiles/g3dlib.dir/source/AnyTableReader.cpp.o
[ 1%] Building CXX object dep/recastnavigation/Recast/CMakeFiles/Recast.dir/Source/RecastFilter.cpp.o
In file included from /root/Repos/Legion/src/common/PrecompiledHeaders/commonPCH.cpp:1:
In file included from /root/Repos/Legion/src/common/PrecompiledHeaders/commonPCH.h:7:
/root/Repos/Legion/src/common/Logging/Log.h:128:18: error: use of class template 'boost::asio::strand' requires template arguments
boost::asio::strand* _strand;
^
/usr/include/boost/asio/strand.hpp:29:7: note: template is declared here
class strand
^
[ 1%] Linking CXX shared module libprotoPCH.cpp_dephelp.so
[ 1%] Building CXX object dep/recastnavigation/Recast/CMakeFiles/Recast.dir/Source/RecastLayers.cpp.o
[ 1%] Building CXX object dep/recastnavigation/Detour/CMakeFiles/Detour.dir/Source/DetourNavMeshQuery.cpp.o
[ 1%] Building CXX object dep/gsoap/CMakeFiles/gsoap.dir/stdsoap2.cpp.o
[ 1%] Built target protoPCH.cpp_dephelp
[ 1%] Building CXX object dep/recastnavigation/Recast/CMakeFiles/Recast.dir/Source/RecastMesh.cpp.o
1 error generated.
make[2]: *** [src/common/CMakeFiles/commonPCH.cpp_dephelp.dir/build.make:63: src/common/CMakeFiles/commonPCH.cpp_dephelp.dir/PrecompiledHeaders/commonPCH.cpp.o] Error 1
make[1]: *** [CMakeFiles/Makefile2:986: src/common/CMakeFiles/commonPCH.cpp_dephelp.dir/all] Error 2
make[1]: *** Waiting for unfinished jobs....
[ 1%] Building CXX object dep/recastnavigation/Recast/CMakeFiles/Recast.dir/Source/RecastMeshDetail.cpp.o
[ 1%] Building CXX object dep/g3dlite/CMakeFiles/g3dlib.dir/source/BinaryFormat.cpp.o
[ 2%] Building CXX object dep/recastnavigation/Recast/CMakeFiles/Recast.dir/Source/RecastRasterization.cpp.o
[ 2%] Building CXX object dep/cds/CMakeFiles/cds.dir/src/init.cpp.o
[ 2%] Building CXX object dep/fmt/CMakeFiles/fmt.dir/fmt/printf.cc.o
[ 2%] Building CXX object dep/g3dlite/CMakeFiles/g3dlib.dir/source/BinaryInput.cpp.o
[ 3%] Building CXX object dep/g3dlite/CMakeFiles/g3dlib.dir/source/BinaryOutput.cpp.o
[ 3%] Building CXX object dep/cds/CMakeFiles/cds.dir/src/thread_data.cpp.o
[ 3%] Building CXX object dep/recastnavigation/Recast/CMakeFiles/Recast.dir/Source/RecastRegion.cpp.o
[ 3%] Building CXX object dep/recastnavigation/Detour/CMakeFiles/Detour.dir/Source/DetourNode.cpp.o
[ 3%] Building CXX object dep/cds/CMakeFiles/cds.dir/src/topology_hpux.cpp.o
[ 3%] Building CXX object dep/cds/CMakeFiles/cds.dir/src/topology_linux.cpp.o
[ 3%] Building CXX object dep/protobuf/CMakeFiles/protobuf.dir/src/google/protobuf/descriptor.cc.o
[ 3%] Building CXX object dep/cds/CMakeFiles/cds.dir/src/topology_osx.cpp.o
[ 3%] Linking CXX static library libDetour.a
[ 3%] Built target Detour
[ 3%] Building CXX object dep/protobuf/CMakeFiles/protobuf.dir/src/google/protobuf/descriptor.pb.cc.o
[ 3%] Building CXX object dep/g3dlite/CMakeFiles/g3dlib.dir/source/Box.cpp.o
[ 3%] Building CXX object dep/cds/CMakeFiles/cds.dir/src/urcu_gp.cpp.o
[ 3%] Building CXX object dep/g3dlite/CMakeFiles/g3dlib.dir/source/Capsule.cpp.o
[ 3%] Building CXX object dep/protobuf/CMakeFiles/protobuf.dir/src/google/protobuf/descriptor_database.cc.o
[ 3%] Linking CXX static library libRecast.a
[ 3%] Built target Recast
[ 3%] Building CXX object dep/protobuf/CMakeFiles/protobuf.dir/src/google/protobuf/dynamic_message.cc.o
[ 3%] Building CXX object dep/cds/CMakeFiles/cds.dir/src/urcu_sh.cpp.o
[ 3%] Building CXX object dep/g3dlite/CMakeFiles/g3dlib.dir/source/CollisionDetection.cpp.o
[ 3%] Building CXX object dep/fmt/CMakeFiles/fmt.dir/fmt/posix.cc.o
[ 3%] Building CXX object dep/g3dlite/CMakeFiles/g3dlib.dir/source/CoordinateFrame.cpp.o
[ 3%] Building CXX object dep/g3dlite/CMakeFiles/g3dlib.dir/source/Crypto.cpp.o
[ 3%] Linking CXX static library libcds.a
[ 3%] Built target cds
[ 3%] Building CXX object dep/g3dlite/CMakeFiles/g3dlib.dir/source/Cylinder.cpp.o
[ 3%] Linking CXX static library libfmt.a
[ 3%] Building CXX object dep/g3dlite/CMakeFiles/g3dlib.dir/source/debugAssert.cpp.o
[ 3%] Built target fmt
[ 3%] Building CXX object dep/g3dlite/CMakeFiles/g3dlib.dir/source/FileSystem.cpp.o
[ 3%] Building CXX object dep/protobuf/CMakeFiles/protobuf.dir/src/google/protobuf/extension_set.cc.o
[ 3%] Building CXX object dep/g3dlite/CMakeFiles/g3dlib.dir/source/fileutils.cpp.o
[ 3%] Building CXX object dep/g3dlite/CMakeFiles/g3dlib.dir/source/format.cpp.o
[ 3%] Building CXX object dep/g3dlite/CMakeFiles/g3dlib.dir/source/g3dfnmatch.cpp.o
[ 3%] Building CXX object dep/g3dlite/CMakeFiles/g3dlib.dir/source/g3dmath.cpp.o
[ 3%] Building CXX object dep/g3dlite/CMakeFiles/g3dlib.dir/source/GThread.cpp.o
[ 3%] Building CXX object dep/g3dlite/CMakeFiles/g3dlib.dir/source/Line.cpp.o
[ 3%] Building CXX object dep/protobuf/CMakeFiles/protobuf.dir/src/google/protobuf/extension_set_heavy.cc.o
[ 3%] Building CXX object dep/g3dlite/CMakeFiles/g3dlib.dir/source/LineSegment.cpp.o
[ 3%] Building CXX object dep/g3dlite/CMakeFiles/g3dlib.dir/source/Log.cpp.o
[ 3%] Building CXX object dep/g3dlite/CMakeFiles/g3dlib.dir/source/Matrix3.cpp.o
[ 4%] Building CXX object dep/g3dlite/CMakeFiles/g3dlib.dir/source/Matrix4.cpp.o
[ 4%] Building CXX object dep/g3dlite/CMakeFiles/g3dlib.dir/source/MemoryManager.cpp.o
[ 4%] Building CXX object dep/protobuf/CMakeFiles/protobuf.dir/src/google/protobuf/generated_message_reflection.cc.o
[ 4%] Building CXX object dep/g3dlite/CMakeFiles/g3dlib.dir/source/PhysicsFrame.cpp.o
[ 4%] Linking CXX static library libgsoap.a
[ 4%] Building CXX object dep/protobuf/CMakeFiles/protobuf.dir/src/google/protobuf/generated_message_util.cc.o
[ 4%] Built target gsoap
[ 4%] Building CXX object dep/g3dlite/CMakeFiles/g3dlib.dir/source/Plane.cpp.o
[ 4%] Building CXX object dep/g3dlite/CMakeFiles/g3dlib.dir/source/prompt.cpp.o
[ 5%] Building CXX object dep/protobuf/CMakeFiles/protobuf.dir/src/google/protobuf/io/coded_stream.cc.o
[ 5%] Building CXX object dep/protobuf/CMakeFiles/protobuf.dir/src/google/protobuf/io/gzip_stream.cc.o
[ 5%] Building CXX object dep/protobuf/CMakeFiles/protobuf.dir/src/google/protobuf/io/printer.cc.o
[ 5%] Building CXX object dep/g3dlite/CMakeFiles/g3dlib.dir/source/Quat.cpp.o
[ 5%] Building CXX object dep/g3dlite/CMakeFiles/g3dlib.dir/source/Random.cpp.o
[ 5%] Building CXX object dep/protobuf/CMakeFiles/protobuf.dir/src/google/protobuf/io/strtod.cc.o
[ 5%] Building CXX object dep/protobuf/CMakeFiles/protobuf.dir/src/google/protobuf/io/tokenizer.cc.o
[ 5%] Building CXX object dep/g3dlite/CMakeFiles/g3dlib.dir/source/Ray.cpp.o
[ 5%] Building CXX object dep/g3dlite/CMakeFiles/g3dlib.dir/source/RegistryUtil.cpp.o
[ 5%] Building CXX object dep/g3dlite/CMakeFiles/g3dlib.dir/source/Sphere.cpp.o
[ 5%] Building CXX object dep/g3dlite/CMakeFiles/g3dlib.dir/source/stringutils.cpp.o
[ 5%] Building CXX object dep/g3dlite/CMakeFiles/g3dlib.dir/source/System.cpp.o
[ 5%] Building CXX object dep/g3dlite/CMakeFiles/g3dlib.dir/source/TextInput.cpp.o
[ 5%] Building CXX object dep/protobuf/CMakeFiles/protobuf.dir/src/google/protobuf/io/zero_copy_stream.cc.o
[ 5%] Building CXX object dep/g3dlite/CMakeFiles/g3dlib.dir/source/TextOutput.cpp.o
[ 5%] Building CXX object dep/protobuf/CMakeFiles/protobuf.dir/src/google/protobuf/io/zero_copy_stream_impl.cc.o
[ 5%] Building CXX object dep/g3dlite/CMakeFiles/g3dlib.dir/source/Triangle.cpp.o
[ 5%] Building CXX object dep/g3dlite/CMakeFiles/g3dlib.dir/source/uint128.cpp.o
[ 5%] Building CXX object dep/g3dlite/CMakeFiles/g3dlib.dir/source/UprightFrame.cpp.o
[ 5%] Building CXX object dep/protobuf/CMakeFiles/protobuf.dir/src/google/protobuf/io/zero_copy_stream_impl_lite.cc.o
[ 5%] Building CXX object dep/protobuf/CMakeFiles/protobuf.dir/src/google/protobuf/message.cc.o
[ 5%] Building CXX object dep/protobuf/CMakeFiles/protobuf.dir/src/google/protobuf/message_lite.cc.o
[ 5%] Building CXX object dep/g3dlite/CMakeFiles/g3dlib.dir/source/Vector2.cpp.o
[ 6%] Building CXX object dep/g3dlite/CMakeFiles/g3dlib.dir/source/Vector3.cpp.o
[ 6%] Building CXX object dep/g3dlite/CMakeFiles/g3dlib.dir/source/Vector4.cpp.o
[ 6%] Building CXX object dep/protobuf/CMakeFiles/protobuf.dir/src/google/protobuf/reflection_ops.cc.o
[ 6%] Building CXX object dep/protobuf/CMakeFiles/protobuf.dir/src/google/protobuf/repeated_field.cc.o
[ 6%] Building CXX object dep/protobuf/CMakeFiles/protobuf.dir/src/google/protobuf/service.cc.o
[ 6%] Building CXX object dep/protobuf/CMakeFiles/protobuf.dir/src/google/protobuf/stubs/common.cc.o
[ 6%] Building CXX object dep/protobuf/CMakeFiles/protobuf.dir/src/google/protobuf/stubs/once.cc.o
[ 6%] Building CXX object dep/protobuf/CMakeFiles/protobuf.dir/src/google/protobuf/stubs/structurally_valid.cc.o
[ 6%] Building CXX object dep/protobuf/CMakeFiles/protobuf.dir/src/google/protobuf/stubs/stringprintf.cc.o
[ 6%] Building CXX object dep/protobuf/CMakeFiles/protobuf.dir/src/google/protobuf/stubs/strutil.cc.o
[ 7%] Building CXX object dep/protobuf/CMakeFiles/protobuf.dir/src/google/protobuf/stubs/substitute.cc.o
[ 7%] Building CXX object dep/protobuf/CMakeFiles/protobuf.dir/src/google/protobuf/text_format.cc.o
[ 7%] Building CXX object dep/protobuf/CMakeFiles/protobuf.dir/src/google/protobuf/unknown_field_set.cc.o
[ 7%] Building CXX object dep/protobuf/CMakeFiles/protobuf.dir/src/google/protobuf/wire_format_lite.cc.o
[ 7%] Building CXX object dep/protobuf/CMakeFiles/protobuf.dir/src/google/protobuf/wire_format.cc.o
[ 7%] Building CXX object dep/protobuf/CMakeFiles/protobuf.dir/src/google/protobuf/stubs/atomicops_internals_x86_gcc.cc.o
[ 7%] Linking CXX static library libg3dlib.a
[ 7%] Built target g3dlib
[ 7%] Linking CXX static library libprotobuf.a
[ 7%] Built target protobuf
make: *** [Makefile:130: all] Error 2
 
Upvote 0

devmelh

Capataz
Desde
22 May 2020
Mensajes
13
Reacciones
6
Honor
30
El proyecto que intentas compilar ya esta archivado si quieres compilar esa version deberias consultar que version de cmake usaron las librerías de compliacion no son las misma, por el mensaje de librerias obsoletas te recomendaria usar una version inferior en tu server de linux ya que los metodos no estan declarados correctamente, lo otro es modificar el codigo en C para corregir la forma de llamado al compilar, mientras no tengas la version exacta no podrás compilarlo
 
Upvote 0

Crea una cuenta o inicia sesión para comentar

Debes ser usuario para poder dejar un comentario.

¡Regístrate!

Crea una cuenta en nuestra comunidad. ¡Es fácil!

Acceder

¿Ya tienes una cuenta? Accede aquí

3,968Temas
26,013Mensajes
15,894Usuarios
val3ntin12Último usuario
Top